No,Gender,Outcome,COVID SEVERITY,Blood Pressure (mmHg) ,HR (BPM),RR (/min),SpO2 (%),Weight (Kg) / Height (cm),Hb (g/dL),Ht (%),Leukosit (per mcl),Platelet1  (/muL),Diff Count (B/E/N/L/M) - %,SpO2 (%).1,PaO2 (mmHg),FiO2 (%),Ddimer #1 (mg/dL),Fibrinogen #1 (mg/dL),Prothrombin Time #1 (second),Ferritin #1 (mg/mL),IL-6 #1 (pg/mL),Hb #1 (g/dL),Ht #1 (%),Leukosit #1 (per mcL),Platelet #2 (per mcL),Diff Count (B/E/N/L/M) #1 - %,SpO2 #1 (%),PaO2 #1 (mmHg),FiO2 #1 (%),Ddimer #2 (mg/dL),Fibrinogen #2 (mg/dL),Prothrombin Time #2 (second),Ferritin #2 (second),IL-6 #2 (pg/mL),meropenem,levofloxacin,azithromycin,oseltamivir,favipiravir,remdesivir,hcq,enoxaparin,dosisenox,heparin,fondaparinux,aspirin,clopidogrel,metilprednisolon,dexametason,hidrokortison,multivitamin,vitaminc,vitamind,zinc,lansoprazol,omeprazol,ranitidin,sucralfat,paracetamol,metisoprinol,asetilsistein,aPTT #1 (second),aPTT #2 (second),CRP #1 (mg/dL),CRP #2 (mg/dL),Survival Status,Total of comorbidities,Age (Years),BMI (Kg^2m),fio2 (%),spo2/fio2 #1,spo2/fio2 #2,PT ratio #1,PT ratio #2
1,Male,Improved,Severe,127/80,97,22,99,73/165,14.7,42,9.45,221,0/0/74/17/9,99.0,219.0,1.0,0.62,713,10,685.0,2.84,14.3,42.0,12.8,528,0/0/82/12/6,99.0,95.0,0.21,1.05,361,10,702.0,1.01,Yes,Yes,No,No,No,Yes,Yes,No,No,Yes,No,No,No,Yes,No,No,Yes,Yes,Yes,Yes,Yes,No,No,No,Yes,No,Yes,24k24,22k24,93.2,2.8,Survived,0,40,26.81359044995409,51,194.1176470588235,471.4285714285714,0.9090909090909091,0.9090909090909091
2,Male,Worsened,Severe,161/76,62,18,98,75/170,13.9,38,4.84,189,0/0/78/18/4,98.0,88.0,1.0,1.5,626,11,4413.0,0.61,13.0,36.0,10.33,125,0/0/94/4/2,94.0,63.0,1.0,2.71,411,11,2137.0,8.24,No,No,Yes,No,Yes,No,No,No,No,Yes,No,No,No,Yes,No,No,No,Yes,Yes,Yes,Yes,No,No,No,No,No,Yes,26k25,27k24,72.1,46.7,Non survived,1,67,25.95155709342561,66,148.4848484848485,94.0,0.9166666666666666,1.0
3,Male,Worsened,Severe,135/78,84,21,90,85/165,14.6,44,7.76,201,0/1/58/36/5,91.0,53.0,1.0,0.74,900,10,463.0,16.1,12.1,36.0,12.9,360,0/0/77/16/7,96.0,78.0,1.0,1.47,491,12,300.0,25.24,Yes,No,Yes,No,Yes,No,Yes,No,No,Yes,No,No,No,Yes,No,No,No,Yes,Yes,Yes,No,No,No,No,Yes,No,Yes,31k26,29k25,109.2,88.1,Survived,2,62,31.22130394857668,66,136.3636363636363,96.0,0.9090909090909091,1.090909090909091
4,Female,Worsened,Severe,110/62,84,22,93,67/164,13.0,38,4.36,280,0/0/64/30/6,94.0,61.0,1.0,0.45,744,10,1364.0,208.9,12.0,36.0,14.87,212,0/0/91/5/4,95.0,69.0,1.0,35.2,342,11,1479.0,63.47,Yes,Yes,Yes,No,No,Yes,No,No,No,Yes,No,No,No,Yes,No,No,Yes,No,Yes,Yes,No,No,No,No,Yes,No,No,29k24,22k24,96.2,51.8,Non survived,1,51,24.91076740035694,66,140.9090909090909,95.0,0.9090909090909091,1.0
5,Male,Worsened,Severe,131/84,89,20,96,73/172,14.6,42,7.35,426,0/0/70/22/8,100.0,194.0,1.0,1.36,597,11,2130.0,7.67,13.0,37.0,16.32,487,0/0/85/7/8,87.0,52.0,1.0,0.97,478,11,1111.0,9.65,No,No,Yes,No,Yes,No,No,No,No,Yes,No,No,No,Yes,No,No,No,Yes,Yes,Yes,No,No,No,No,No,No,No,25k24,25k25,48.8,9.4,Survived,1,55,24.67550027041644,60,160.0,87.0,1.0,1.0
6,Male,Worsened,Severe,140/92,85,22,97,84/168,12.6,37,6.62,283,0/0/80/14/6,99.0,111.0,1.0,2.4,733,10,1293.0,1.58,12.6,37.0,17.35,260,0/0/91/6/3,98.0,103.0,1.0,15.84,491,11,933.0,0.81,Yes,No,No,No,No,Yes,No,No,No,Yes,No,No,No,Yes,No,No,Yes,Yes,Yes,Yes,No,No,No,No,Yes,No,Yes,28k24,50k25,58.2,9.7,Survived,2,52,29.76190476190477,57,170.1754385964912,98.0,0.9090909090909091,0.9166666666666666
7,Male,Improved,Severe,139/88,81,20,93,75/170,15.6,46,5.35,373,0/0/86/12/2,94.0,64.0,1.0,1.55,900,11,1999.0,0.43,14.8,41.0,13.08,306,0/0/84/12/4,92.0,60.0,0.37,1.14,431,11,1986.0,1.46,No,Yes,No,No,No,Yes,No,No,No,Yes,No,No,No,Yes,No,No,No,Yes,Yes,Yes,No,No,No,No,Yes,No,Yes,23k23,37k25,23.8,2.3,Survived,1,47,25.95155709342561,51,182.3529411764706,248.6486486486486,1.0,0.0990990990990991
8,Female,Worsened,Severe,145/83,58,24,98,70/160,13.8,43,20.42,376,0/0/93/5/2,98.0,87.0,0.8,4.93,528,10,1417.0,0.43,12.6,37.0,19.07,277,0/0/85/10/5,91.0,57.0,0.4,3.86,587,11,1938.0,4.87,Yes,Yes,No,No,Yes,No,No,No,No,Yes,No,No,No,Yes,No,No,No,Yes,Yes,Yes,No,Yes,No,No,No,No,Yes,38k24,23k25,31.2,37.5,Survived,1,57,27.34375,66,148.4848484848485,227.5,0.9090909090909091,1.0
9,Male,Worsened,Severe,93/66,112,35,90,80/170,13.8,43,12.01,284,0/0/87/6/7,46.0,82.0,1.0,8.86,733,11,2155.0,2.45,15.4,50.0,15.3,359,0/0/90/2/8,82.0,55.0,1.0,9.46,261,12,2168.0,16.93,Yes,Yes,No,No,No,Yes,No,No,No,Yes,No,No,No,Yes,No,No,Yes,Yes,Yes,Yes,Yes,No,No,No,Yes,No,Yes,37k24,30k25,34.2,13.4,Non survived,0,55,27.68166089965398,100,90.0,82.0,1.0,1.090909090909091
10,Male,Worsened,Severe,151/89,77,20,98,86/172,12.7,36,9.99,333,0/0/93/5/2,99.0,125.0,1.0,1.81,900,11,2148.0,0.28,13.1,40.0,29.3,348,0/0/69/23/8,93.0,104.0,1.0,4.31,766,12,11310.0,1.46,Yes,Yes,No,No,No,Yes,No,No,No,Yes,No,No,No,Yes,No,No,No,Yes,Yes,Yes,Yes,No,No,No,No,No,Yes,20k26,44k27,48.7,114.0,Non survived,0,67,29.06976744186047,51,192.156862745098,93.0,1.0,1.0
11,Male,Worsened,Severe,128/87,105,24,83,60/160,14.8,43,8.86,234,0/0/87/8/5,90.0,50.0,1.0,35.2,442,13,893.0,0.43,13.3,37.0,18.5,189,0/0/94/2/4,93.0,65.0,1.0,5.21,583,11,748.0,0.81,No,Yes,Yes,No,No,Yes,No,No,No,Yes,No,No,No,Yes,No,No,Yes,Yes,Yes,Yes,Yes,No,No,No,No,No,Yes,21k25,24k25,48.9,88.6,Survived,0,67,23.4375,66,125.7575757575758,93.0,1.181818181818182,0.9166666666666666
12,Male,Worsened,Severe,166/96,84,22,98,74/168,15.0,42,8.29,107,0/0/88/5/7,98.0,98.0,1.0,0.73,806,11,869.0,0.91,16.4,46.0,6.62,156,0/0/84/7/9,95.0,63.0,1.0,1.37,352,13,1366.0,0.81,Yes,Yes,No,No,No,Yes,No,No,No,Yes,No,No,No,Yes,No,No,Yes,Yes,Yes,Yes,No,No,No,No,Yes,No,Yes,29k24,76k25,20.3,1.2,Non survived,2,71,26.21882086167801,57,171.9298245614035,95.0,1.0,1.181818181818182
13,Female,Improved,Severe,170/110,118,32,100,68/159,12.9,38,16.7,246,0/0/89/6/5,99.0,242.0,1.0,10.88,592,11,592.0,1.01,11.8,35.0,9.75,244,0/0/81/12/7,100.0,169.0,0.8,1.41,401,12,995.0,18.04,Yes,No,No,No,No,Yes,No,No,No,Yes,No,No,Yes,Yes,No,No,Yes,Yes,Yes,Yes,Yes,No,No,No,No,No,Yes,21k26,107k25,43.9,10.9,Survived,2,76,26.89767018709703,66,151.5151515151515,125.0,1.0,1.090909090909091
14,Male,Improved,Severe,134/101,115,22,90,59/160,15.3,43,10.6,368,0/0/89/3/8,96.0,76.0,1.0,35.2,476,12,4077.0,3.77,13.6,39.0,15.34,301,0/0/90/3/7,96.0,71.0,1.0,1.11,389,12,3026.0,1.46,Yes,Yes,No,No,No,Yes,No,No,No,Yes,No,No,No,Yes,No,No,Yes,Yes,Yes,Yes,Yes,No,No,No,Yes,No,Yes,24k25,25k25,160.4,15.3,Survived,0,63,23.046875,66,136.3636363636363,96.0,1.090909090909091,1.0
15,Female,Improved,Severe,222/110,147,25,100,70/160,12.9,36,3.56,169,0/0/87/10/3,94.0,63.0,1.0,0.45,398,10,767.0,9079.62,11.4,32.0,17.57,266,0/0/94/2/4,96.0,76.0,1.0,1.17,621,11,1031.0,11.63,Yes,Yes,No,No,Yes,No,No,No,No,Yes,No,No,No,Yes,No,No,Yes,Yes,Yes,Yes,No,Yes,No,No,Yes,No,No,23k25,20k25,23.8,28.0,Survived,3,66,27.34375,51,196.078431372549,96.0,0.9090909090909091,0.9166666666666666
16,Female,Improved,Severe,134/75,86,22,96,84/170,10.6,32,20.82,525,0/0/94/4/2,100.0,270.0,1.0,17.59,583,11,560.0,27.12,11.3,33.0,19.07,421,0/0/93/4/3,97.0,89.0,1.0,9.1,313,12,560.0,5.42,Yes,No,No,No,Yes,No,No,No,No,Yes,No,No,No,Yes,No,No,Yes,Yes,Yes,Yes,No,No,No,No,Yes,No,Yes,23k24,20k24,118.3,47.5,Survived,0,61,29.06574394463668,66,145.4545454545455,97.0,1.0,1.090909090909091
17,Male,Improved,Severe,141/91,91,20,98,68/168,15.2,44,3.71,130,0/0/81/13/6,98.0,,0.32,0.75,491,10,2334.0,2287.6,12.4,38.0,5.69,232,1/0/77/12/10,99.0,0.0,0.24,0.45,744,11,1029.0,132.64,No,Yes,No,No,No,Yes,No,No,No,No,Yes,No,No,Yes,No,No,No,Yes,Yes,No,Yes,No,No,No,Yes,No,Yes,23k24,28k25,7.4,11.1,Survived,2,72,24.09297052154195,36,272.2222222222222,412.5,0.9090909090909091,0.9166666666666666
18,Male,Worsened,Severe,124/80,79,38,95,70/163,13.2,36,12.23,298,0/0/86/4/10,99.0,126.0,1.0,0.6,755,10,2468.0,1.46,13.9,39.0,13.7,465,0/0/94/1/5,77.0,44.0,1.0,4.21,613,12,1204.0,1.23,Yes,Yes,No,No,No,Yes,No,No,No,Yes,No,No,No,Yes,No,No,Yes,Yes,Yes,Yes,Yes,No,No,Yes,Yes,No,Yes,26k24,27k25,42.0,53.5,Non survived,1,48,26.34649403440099,66,143.9393939393939,77.0,0.9090909090909091,1.333333333333333
19,Female,Worsened,Severe,160/70,77,22,99,46/160,12.0,33,4.79,185,0/0/84/11/5,100.0,202.0,1.0,2.84,361,12,24316.0,3.23,11.8,33.0,33.2,198,0/0/97/1/2,66.0,45.0,1.0,35.2,611,12,100000.0,36.54,Yes,No,No,No,Yes,No,No,No,No,Yes,No,No,No,Yes,No,No,Yes,Yes,Yes,Yes,Yes,No,No,No,Yes,No,Yes,37k25,37k24,30.7,142.0,Non survived,2,87,17.96875,48,206.25,66.0,1.090909090909091,1.0
20,Male,Improved,Severe,159/88,78,27,87,68/173,10.8,31,7.21,166,2/0/83/12/3,97.0,90.0,1.0,2.77,778,10,1523.0,63.47,9.8,27.0,8.16,218,0/0/90/5/5,97.0,81.0,0.41,1.31,411,10,1424.0,14.15,Yes,No,No,Yes,No,No,No,No,No,Yes,No,No,No,Yes,No,No,Yes,Yes,Yes,Yes,No,No,No,No,Yes,No,No,26k25,24k24,39.4,3.8,Survived,2,83,22.72043837081092,66,131.8181818181818,236.5853658536585,1.0,0.8333333333333334
21,Male,Improved,Severe,111/73,94,28,91,84/165,14.7,43,20.47,341,0/0/94/4/2,99.0,135.0,1.0,1.24,900,11,1333.0,45.2,17.2,51.0,16.41,331,0/0/85/10/5,98.0,94.0,0.21,1.16,414,11,1301.0,36.0,Yes,No,Yes,No,No,Yes,No,No,No,Yes,No,No,No,Yes,No,No,Yes,Yes,Yes,Yes,Yes,No,No,No,No,No,Yes,,,25.1,3.5,Survived,1,66,30.85399449035813,51,178.4313725490196,466.6666666666667,1.0,0.9166666666666666
22,Male,Worsened,Severe,140/80,96,34,70,79/170,15.0,41,19.15,242,0/0/92/5/3,89.0,57.0,1.0,1.08,900,11,12572.0,5.15,12.1,34.0,15.3,286,0/0/87/5/8,94.0,70.0,1.0,9.8,463,12,4595.0,0.61,Yes,Yes,No,No,No,Yes,No,No,No,Yes,No,No,No,Yes,No,No,Yes,Yes,Yes,Yes,Yes,No,No,No,No,No,Yes,24k24,25k25,97.4,22.8,Non survived,0,75,27.33564013840831,66,106.0606060606061,94.0,1.0,1.0
23,Male,Improved,Severe,155/81,97,24,98,80/165,14.7,42,10.8,407,0/0/92/4/4,95.0,79.0,1.0,5.9,755,12,1232.0,375.65,13.3,38.0,19.75,220,0/0/91/4/5,91.0,58.0,1.0,0.9,289,11,1855.0,41.53,Yes,Yes,No,No,No,Yes,No,No,No,Yes,No,No,No,Yes,No,No,Yes,Yes,Yes,Yes,No,Yes,No,No,Yes,No,Yes,28k25,26k24,56.6,3.7,Non survived,1,73,29.38475665748393,66,148.4848484848485,91.0,1.0,1.0
24,Male,Worsened,Severe,120/57,77,24,97,80/175,10.7,30,9.6,213,0/0/94/3/3,93.0,73.0,1.0,3.8,652,10,5701.0,7.67,11.2,37.0,10.8,290,0/0/87/9/4,71.0,64.0,1.0,27.26,426,12,3812.0,4.18,Yes,Yes,No,No,No,Yes,No,No,No,Yes,No,No,No,Yes,No,No,Yes,Yes,Yes,Yes,Yes,No,No,No,Yes,No,Yes,27k24,120k24,339.8,57.6,Non survived,2,59,26.12244897959184,100,97.0,71.0,0.9090909090909091,1.090909090909091
25,Male,Worsened,Severe,149/83,101,34,93,64/168,13.1,37,8.87,294,0/0/84/10/6,96.0,68.0,1.0,1.21,553,11,1359.0,10.78,13.2,38.0,12.02,287,0/0/92/3/5,91.0,56.0,1.0,0.71,321,12,678.0,6.55,Yes,Yes,No,No,No,Yes,No,No,No,Yes,No,No,No,Yes,No,No,Yes,Yes,Yes,Yes,Yes,No,No,No,No,No,Yes,30k24,34k24,39.3,7.2,Survived,1,69,22.67573696145125,66,140.9090909090909,91.0,1.0,1.090909090909091
26,Male,Improved,Severe,120/70,107,22,98,70/170,13.1,38,11.67,280,0/0/85/9/6,99.0,153.0,0.8,0.74,621,11,2660.0,1.94,14.1,40.0,8.79,383,0/0/81/11/8,99.0,106.0,0.28,3.42,597,11,1435.0,22.0,Yes,Yes,No,No,No,Yes,No,No,No,Yes,No,No,No,Yes,No,No,Yes,Yes,Yes,Yes,Yes,No,No,No,No,No,Yes,28k24,24k24,49.4,7.9,Survived,1,47,24.22145328719724,60,163.3333333333333,353.5714285714286,1.0,1.0
27,Male,Improved,Severe,120/83,63,24,98,74/170,14.8,42,11.93,281,0/0/81/12/7,93.6,62.8,0.95,1.06,733,11,944.0,5.42,14.8,42.0,12.3,349,0/0/84/9/7,98.0,,0.4,1.03,411,11,1160.0,13.31,Yes,Yes,No,No,No,Yes,No,No,No,Yes,No,No,No,Yes,No,No,Yes,Yes,Yes,Yes,No,Yes,No,No,No,No,Yes,39k34,40k24,24.4,3.8,Survived,0,30,25.60553633217993,57,171.9298245614035,245.0,0.9166666666666666,1.0
28,Male,Improved,Moderate,130/80,78,20,97,81/170,13.7,39,5.59,254,0/0/76/15/9,100.0,182.0,0.4,0.8,684,10,2671.0,25.64,14.5,42.0,10.23,346,0/0/80/9/11,98.0,,0.24,0.43,325,12,325.0,1.94,Yes,No,Yes,No,No,Yes,No,No,No,Yes,No,No,No,Yes,No,No,Yes,Yes,Yes,Yes,Yes,No,No,No,Yes,No,Yes,21k23.8,32k24.3,54.8,3.0,Survived,1,61,28.02768166089966,30,323.3333333333333,408.3333333333334,0.8695652173913043,1.03448275862069
29,Male,Improved,Severe,134/94,89,20,99,91/172,14.1,41,6.78,309,0/0/61/28/11,99.0,,0.4,0.3,401,10,340.6,83.75,16.3,46.0,17.93,341,0/0/88/9/3,99.0,,0.24,0.32,321,9,306.3,7.39,No,Yes,Yes,No,Yes,No,No,No,No,No,No,No,No,Yes,No,No,No,Yes,Yes,Yes,No,No,No,No,No,No,Yes,19k24,19k24,358.0,0.7,Survived,0,35,30.75987020010817,36,275.0,412.5,0.9090909090909091,0.8181818181818182
30,Female,Improved,Severe,155/89,115,26,100,65/160,14.8,44,10.16,214,0/0/60/32/8,100.0,167.0,0.95,0.19,802,12,1891.0,408.59,11.5,33.0,18.3,245,0/0/84/11/5,99.0,141.0,0.24,1.61,641,12,1847.0,14.71,No,Yes,No,No,No,Yes,No,Yes,No,No,No,No,No,Yes,No,No,Yes,Yes,Yes,Yes,Yes,No,No,No,Yes,No,Yes,26k24,30k24.3,41.1,12.0,Survived,0,60,25.390625,45,222.2222222222222,412.5,1.0,1.03448275862069
31,Male,Worsened,Severe,130/70,94,23,97,80/168,14.24,41,14.24,389,0/0/86/5/9,98.0,96.2,0.95,0.81,885,10,1318.0,4.04,14.6,41.0,10.85,427,0/0/90/8/2,96.4,76.9,0.4,0.86,401,11,1254.0,0.91,Yes,No,No,No,No,Yes,No,No,No,Yes,No,No,No,Yes,No,No,Yes,Yes,Yes,Yes,Yes,No,No,No,Yes,No,No,23k24,23k24,100.1,4.9,Survived,0,54,28.34467120181406,33,293.9393939393939,241.0,0.8333333333333334,1.0
32,Male,Improved,Severe,140/90,86,23,96,74/170,15.2,43,7.08,251,0/0/87/8/5,98.0,90.0,0.9,0.46,483,10,1331.0,0.43,14.9,42.0,10.86,256,0/0/89/9/2,99.0,124.8,0.4,0.2,174,11,1229.0,0.91,No,Yes,Yes,No,No,Yes,No,No,No,No,Yes,No,No,Yes,No,No,No,Yes,Yes,Yes,Yes,No,No,No,No,No,Yes,22k24,22k24,15.1,2.0,Survived,2,60,25.60553633217993,48,200.0,247.5,0.9090909090909091,1.018518518518518
33,Male,Improved,Moderate,120/80,60,20,98,70/160,12.9,36,6.63,157,0/0/88/7/5,98.0,,0.24,0.64,317,11,1540.0,151.68,14.4,40.0,10.6,195,0/0/86/9/5,98.0,,0.24,0.32,314,10,1691.0,124.7,Yes,No,No,No,No,Yes,No,No,No,No,Yes,No,No,Yes,No,No,Yes,Yes,Yes,Yes,Yes,No,No,No,Yes,No,No,25k23.8,24k24,10.1,1.6,Survived,0,61,27.34375,21,466.6666666666667,408.3333333333334,1.089108910891089,0.9259259259259258
34,Female,Worsened,Severe,153/81,100,24,88,70/165,14.4,43,9.23,261,0/0/93/4/3,99.0,151.0,1.0,0.99,766,12,1731.0,0.52,10.2,30.0,25.65,231,0/0/97/2/1,93.9,62.0,1.0,3.08,802,11,1512.0,36.67,Yes,No,Yes,No,Yes,No,No,No,No,Yes,No,No,No,Yes,No,No,Yes,Yes,Yes,Yes,Yes,No,No,No,Yes,No,Yes,25k25,24k25,108.8,29.4,Non survived,2,69,25.71166207529844,66,133.3333333333333,93.9,1.333333333333333,1.0
35,Male,Worsened,Severe,106/98,104,34,92,98/160,16.1,44,9.11,156,0/0/82/12/6,93.0,60.0,1.0,0.96,863,11,1411.0,26.44,15.6,42.0,13.4,171,0/0/91/6/3,95.0,63.0,1.0,1.74,338,13,2242.0,22.27,Yes,Yes,No,No,No,Yes,No,No,No,Yes,No,No,No,Yes,No,No,Yes,Yes,Yes,Yes,Yes,No,No,No,Yes,No,Yes,>120k24,22k25,120.8,18.7,Survived,1,82,38.28124999999999,66,139.3939393939394,95.0,1.0,1.181818181818182
36,Male,Worsened,Severe,150/87,105,25,95,70/167,15.0,40,14.75,304,0/0/88/6/6,96.0,72.0,0.8,1.1,583,10,1873.0,1.23,12.6,41.0,41.63,268,0/0/92/4/4,93.0,65.0,1.0,4.64,790,12,1293.0,3.77,Yes,No,No,No,No,Yes,No,No,No,Yes,No,No,No,Yes,No,No,Yes,Yes,Yes,Yes,Yes,No,No,No,Yes,No,Yes,22k24,31k25,28.9,32.6,Non survived,0,53,25.09950159561117,66,143.9393939393939,93.0,0.9090909090909091,1.090909090909091
37,Male,Improved,Severe,130/90,93,28,91,70/167,13.8,40,12.48,417,0/0/93/5/2,99.0,117.0,0.95,1.66,885,12,946.0,33.04,16.4,47.0,16.56,262,0/0/85/7/8,99.0,,0.24,1.2,440,11,844.9,30.02,Yes,Yes,No,No,No,Yes,No,No,No,Yes,No,No,No,Yes,No,No,Yes,Yes,Yes,Yes,Yes,No,No,No,No,No,Yes,27k24,23k23,70.9,11.1,Survived,0,54,25.09950159561117,66,137.8787878787879,412.5,1.090909090909091,1.0
38,Female,Improved,Severe,110/69,103,22,98,64/155,11.2,32,15.18,274,0/0/93/3/4,96.0,83.0,0.8,2.52,571,10,818.0,2.07,10.0,30.0,8.46,219,0/2/76/14/8,98.0,102.0,0.28,2.55,235,10,417.5,7.67,No,No,Yes,No,No,Yes,No,No,No,Yes,No,No,No,Yes,No,No,Yes,Yes,Yes,Yes,No,Yes,No,No,No,No,Yes,24k24.3,21k23,62.3,4.3,Survived,1,71,26.63891779396462,51,192.156862745098,349.9999999999999,0.9090909090909091,0.9090909090909091
39,Male,Worsened,Severe,151/87,78,35,91,98/170,13.1,37,11.33,256,0/0/93/3/4,98.0,119.0,1.0,3.98,2186,12,2186.0,140.32,15.0,45.0,30.01,139,0/0/92/2/6,97.0,82.0,1.0,1.83,658,12,1707.0,33.04,Yes,No,No,No,No,Yes,No,No,No,Yes,No,No,No,Yes,No,No,Yes,Yes,Yes,Yes,Yes,No,No,No,Yes,No,Yes,24k24,26k25,52.0,21.8,Non survived,0,56,33.91003460207613,66,137.8787878787879,97.0,1.090909090909091,1.090909090909091
40,Male,Worsened,Severe,110/90,74,31,96,94/188,13.8,39,9.4,177,0/0/88/9/3,97.0,80.0,0.95,0.29,713,10,1869.0,0.61,13.3,38.0,10.92,382,0/0/90/6/4,94.0,67.0,1.0,1.7,498,11,1115.0,2.71,No,No,Yes,No,No,Yes,Yes,No,No,Yes,No,No,No,Yes,No,No,Yes,Yes,Yes,Yes,No,No,No,No,No,No,Yes,30k24,23k24,57.2,3.9,Non survived,0,37,26.59574468085107,66,145.4545454545455,94.0,0.9090909090909091,1.0
41,Female,Improved,Severe,107/92,104,14,94,60/160,12.6,36,24.44,294,0/0/93/2/5,95.0,65.0,1.0,5.56,744,10,2332.0,15.69,12.6,36.0,24.44,294,0/0/93/2/5,96.0,92.0,0.85,2.12,744,11,1860.0,74.16,Yes,Yes,No,No,No,Yes,No,No,No,Yes,No,No,No,Yes,No,No,Yes,Yes,Yes,Yes,Yes,No,No,No,No,No,Yes,28k24,28k23.9,34.8,94.6,Non survived,0,67,23.4375,100,94.0,112.9411764705882,0.9090909090909091,1.0
42,Male,Worsened,Severe,129/79,81,25,95,70/160,15.1,42,12.14,313,0/0/85/5/10,97.0,75.0,0.95,0.49,604,11,1797.0,359.74,14.6,41.0,15.97,450,0/0/91/5/4,96.0,170.0,0.9,0.68,386,11,670.0,1835.77,Yes,No,Yes,No,No,Yes,No,No,No,Yes,No,No,No,No,No,No,Yes,Yes,Yes,Yes,No,No,No,No,No,No,Yes,33k24,65k23.9,73.1,6.9,Survived,1,56,27.34375,66,143.9393939393939,106.6666666666667,1.0,1.0
43,Male,Improved,Moderate,130/90,81,20,99,90/160,13.3,37,9.59,299,0/0/79/10/11,99.0,,0.4,0.47,347,10,1562.0,9856.94,13.7,38.0,10.32,305,0/0/84/8/8,99.0,,0.24,0.43,361,10,1287.0,0.28,No,No,Yes,No,No,Yes,No,No,No,No,Yes,No,No,Yes,No,No,No,Yes,Yes,Yes,No,Yes,No,No,No,No,Yes,23k24,26k23,1.3,2.2,Survived,3,49,35.15624999999999,21,471.4285714285714,412.5,0.9090909090909091,0.9090909090909091
44,Female,Improved,Moderate,130/70,71,20,98,68/162,13.1,37,6.97,244,0/0/76/16/8,98.0,,0.24,0.63,597,11,1326.0,1.01,14.0,39.0,10.33,199,0/0/85/10/5,98.0,,0.24,0.67,597,11,2349.0,0.28,Yes,Yes,No,No,No,Yes,No,No,No,No,Yes,No,No,Yes,No,No,Yes,Yes,Yes,Yes,No,Yes,No,No,No,No,Yes,23k24,26k23,39.7,3.8,Survived,1,58,25.91068434689833,21,466.6666666666667,408.3333333333334,1.0,1.0
45,Male,Improved,Severe,127/67,73,20,98,64/165,13.5,39,3.41,78,0/0/76/16/8,98.0,112.0,0.95,1.45,790,10,1505.0,13.31,13.2,37.0,9.82,164,0/0/89/5/6,99.0,126.0,0.4,1.65,431,11,985.4,2.71,No,Yes,No,No,No,Yes,No,No,No,No,Yes,No,No,Yes,No,No,No,Yes,Yes,Yes,No,Yes,No,No,No,No,Yes,26k24,26k25,88.3,5.0,Survived,0,72,23.50780532598715,66,148.4848484848485,247.5,0.9090909090909091,1.0
46,Female,Improved,Moderate,175/80,63,20,99,60/150,13.2,39,6.19,294,0/2/63/27/8,99.0,,0.24,1.8,361,13,401.2,0.15,12.3,34.0,13.82,367,0/0/87/7/6,99.0,,0.24,0.35,251,10,374.0,0.15,No,No,Yes,No,No,Yes,No,No,No,No,Yes,No,No,Yes,No,No,Yes,Yes,Yes,No,Yes,No,No,No,No,No,Yes,36k24,20k23,21.8,1.6,Survived,0,67,26.66666666666667,21,471.4285714285714,412.5,1.181818181818182,1.0
47,Male,Improved,Severe,127/84,103,20,98,100/163,13.4,38,11.83,209,0/0/92/4/4,98.0,,0.4,0.36,893,11,552.0,4.73,14.5,41.0,13.0,388,0/0/77/15/7,99.0,,0.24,0.25,317,11,766.1,2.45,No,No,Yes,No,No,Yes,No,No,No,No,Yes,No,No,Yes,No,No,Yes,Yes,Yes,No,Yes,No,No,No,No,No,Yes,27k23,24k23,44.4,4.9,Survived,0,39,37.63784862057285,36,272.2222222222222,412.5,0.9166666666666666,1.0
48,Male,Improved,Moderate,136/86,79,20,96,74/163,15.9,47,10.71,335,0/0/88/8/4,96.0,,0.24,0.48,442,10,310.4,12.19,15.1,43.0,12.84,347,0/0/87/8/5,98.0,,0.24,0.3,477,10,300.4,17.63,No,No,Yes,No,No,Yes,No,No,No,No,Yes,No,No,Yes,No,No,Yes,Yes,Yes,No,Yes,No,No,No,No,No,No,24k23.4,25k24,20.3,1.8,Survived,1,55,27.85200797922391,21,457.1428571428571,408.3333333333334,0.9523809523809523,0.9090909090909091
49,Male,Improved,Severe,146/79,105,20,98,80/175,15.1,41,11.84,152,0/0/87/10/3,95.0,69.0,0.24,1.74,983,10,1005.0,2.45,15.1,41.0,10.93,303,0/0/93/4/3,99.0,,0.4,1.51,365,13,717.7,1.23,Yes,No,Yes,No,No,Yes,No,No,No,Yes,No,No,No,Yes,No,No,No,Yes,Yes,Yes,No,Yes,No,No,Yes,No,Yes,23k23.4,26k24.3,142.6,7.3,Survived,1,76,26.12244897959184,39,251.2820512820513,247.5,0.9523809523809523,1.181818181818182
50,Male,Improved,Severe,133/65,95,25,94,85/173,13.5,38,13.24,257,0/0/92/4/4,92.9,58.7,0.8,4.17,703,11,1038.0,7.11,12.5,36.0,15.57,179,0/0/89/2/9,99.0,119.0,0.9,5.35,287,12,813.0,4.32,Yes,No,Yes,No,No,Yes,No,No,No,Yes,No,No,No,Yes,No,No,Yes,Yes,Yes,Yes,No,Yes,No,No,Yes,No,Yes,34k25,56k24,40.7,11.8,Survived,2,80,28.40054796351365,66,142.4242424242424,110.0,1.1,1.2
51,Female,Worsened,Severe,147/94,75,28,86,,12.5,38,3.6,141,0/0/55/31/14,100.0,188.0,0.85,1.57,397,12,2376.0,28.57,12.3,38.0,11.25,104,0/0/86/9/5,77.0,46.0,1.0,10.88,527,11,3063.0,33.26,Yes,No,Yes,No,Yes,No,Yes,No,,No,Yes,No,No,Yes,No,No,No,Yes,Yes,Yes,,,,,,,,30k25,32k24,12.5,211.0,Non survived,1,76,,66,130.3030303030303,77.0,1.090909090909091,1.0
52,Female,Worsened,Severe,169/78,85,30,88,,14.8,43,8.36,264,0/0/79/13/8,89.0,63.0,0.6,0.59,669,11,842.5,26.77,11.8,37.0,19.14,446,1/0/94/3/2,89.0,63.0,1.0,0.85,763,10,894.8,384.02,No,No,No,No,No,No,No,Yes,,No,No,No,No,No,No,No,No,No,No,No,,,,,,,,33k24,34k24,79.3,84.5,Non survived,0,70,,60,146.6666666666667,89.0,1.0,0.9090909090909091
53,Male,Improved,Moderate,148/94,96,20,99,,16.2,47,4.6,110,0/1/57/31/11,99.0,,0.33,0.23,497,10,666.2,41.2,16.1,46.0,13.43,110,0/1/66/23/1,99.0,,0.21,0.31,414,10,719.2,2.46,Yes,Yes,No,No,Yes,No,Yes,No,,Yes,No,No,No,No,No,No,No,Yes,Yes,Yes,,,,,,,,31k25,34k24,28.6,0.3,Survived,1,52,,30,330.0,471.4285714285714,0.9090909090909091,0.9090909090909091
54,Female,Worsened,Severe,130/90,113,20,87,90/170,14.7,41,17.41,191,0/0/90/3/2,84.0,40.0,1.0,4.93,811,11,3297.0,39.01,11.9,39.0,27.53,215,0/0/96/1/3,97.0,87.0,1.0,11.89,527,11,2875.0,788.9,Yes,Yes,Yes,No,Yes,No,Yes,No,,No,Yes,No,No,Yes,Yes,No,No,Yes,Yes,Yes,,,,,,,,28k24,27k24,277.0,55.1,Non survived,1,66,31.14186851211073,100,87.0,97.0,1.0,1.0
55,Male,Improved,Moderate,141/98,75,20,99,80/150,13.2,39,14.84,364,0/0/78/17/5,97.0,91.0,0.33,0.48,334,11,109.9,2.51,14.5,43.0,14.37,428,1/0/90/7/2,98.0,0.0,0.33,0.38,328,11,107.1,1.5,No,Yes,No,No,Yes,No,Yes,No,,Yes,No,No,No,No,Yes,No,No,Yes,Yes,Yes,,,,,,,,28k25,31k24,5.4,1.0,Survived,2,32,35.55555555555556,30,330.0,296.9696969696969,1.0,1.0
56,Female,Worsened,Severe,137/69,93,37,99,,14.4,42,8.4,383,0/1/79/13/7,97.0,80.0,0.51,5.51,678,12,450.0,33.4,11.0,32.0,17.77,433,1/2/79/9/2,89.0,59.0,0.92,20.35,733,12,2932.0,427.5,Yes,No,Yes,No,Yes,No,Yes,No,,No,Yes,No,No,Yes,No,No,No,Yes,Yes,Yes,,,,,,,,29k25,38k24,75.3,171.0,Non survived,3,64,,51,194.1176470588235,96.73913043478261,1.0,1.0
57,Female,Worsened,Severe,154/87,75,20,90,,10.1,29,18.55,436,0/0/91/6/3,95.0,,1.0,1.5,1020,11,1465.0,80.41,10.7,31.0,26.85,446,0/0/99/0/1,95.0,65.0,1.0,0.92,605,12,807.2,13.94,Yes,No,Yes,No,Yes,No,Yes,Yes,,No,No,No,No,Yes,No,No,No,Yes,Yes,Yes,,,,,,,,27k24,33k24,146.0,79.4,Non survived,2,61,,51,176.4705882352941,95.0,1.0,1.090909090909091
58,Female,Worsened,Severe,149/78,85,32,96,,14.2,41,16.19,164,0/0/89/8/3,94.0,61.0,0.36,2.93,900,11,3307.0,233.1,10.0,30.0,16.81,287,1/0/95/3/1,86.0,66.0,0.8,6.24,794,11,2782.0,1210.0,Yes,Yes,Yes,No,Yes,No,Yes,No,,Yes,No,No,No,Yes,No,No,No,Yes,Yes,Yes,,,,,,,,34k24,47k24,31.5,31.5,Non survived,3,61,,66,145.4545454545455,107.5,1.0,1.0
59,Female,Worsened,Severe,101/75,99,24,99,75/175,13.9,40,10.19,151,0/0/91/7/2,98.0,108.0,1.0,35.2,263,13,2365.0,101.6,9.3,28.0,23.64,273,0,94.0,77.0,0.9,35.2,275,12,2187.0,167.1,Yes,No,Yes,No,Yes,No,Yes,No,,Yes,No,No,No,Yes,No,No,Yes,Yes,Yes,No,,,,,,,,28k24,43k24,205.4,326.0,Non survived,0,66,24.48979591836735,70,141.4285714285714,104.4444444444444,1.181818181818182,1.090909090909091
60,Male,Improved,Moderate,116/71,95,21,100,73/167,15.3,44,6.48,182,0/0/65/29/6,100.0,222.0,0.33,0.41,678,11,1932.0,18.47,15.4,43.0,10.26,222,0/2/73/17/8,98.0,,0.21,0.18,778,11,2385.0,3.31,Yes,No,Yes,No,Yes,No,Yes,Yes,,No,No,No,No,No,Yes,No,No,Yes,Yes,Yes,,,,,,,,30k24,26k24,55.1,4.4,Survived,2,44,26.17519452113737,30,333.3333333333334,466.6666666666667,1.0,1.0
61,Male,Improved,Severe,170/120,110,35,92,70/160,15.0,45,11.39,345,0/0/84/11/5,93.0,60.0,1.0,1.73,811,10,1403.0,4.81,16.1,46.0,15.48,447,0/0/92/5/3,99.0,114.0,1.0,1.73,706,11,980.4,1.0,Yes,No,Yes,No,Yes,No,Yes,No,,No,Yes,No,No,Yes,No,No,No,Yes,Yes,Yes,,,,,,,,28k24,26k24,125.9,0.6,Survived,2,43,27.34375,51,180.3921568627451,99.0,0.9090909090909091,1.0